{"text_format":"3","workbook":"xlsx","n_sheets":24,"sheets":["DHCS Only","1. Information","Instructions 1. Information","2. Component Summary","Instructions 2. Component Summa","3. CSS","Instructions 3. CSS","4. PEI","Instructions 4. PEI","5. INN","Instructions 5. INN","6. WET","Instructions 6. WET","7. CFTN","Instructions 7. CFTN","8. Adjustment (MHSA)","Instructions 8. Adjust (MHSA)","9. Adjustment (FFP)","Instructions 9. Adjust (FFP)","10. Comments","Instructions 10. Comments","Checks","drop down fields","E-1 CountyState2017"],"not_rendered":{"macros":1,"external_links":2,"defined_names":133,"comments":1},"read":"whole","date_system":"1900"}

{"sheet":"DHCS Only","index":0,"n_rows":3,"n_cols":1,"rows_kept":3,"hidden":true}
["For DHCS use only."]
["Click button to lock or unlock all sheets for editing. "]
["This tab should be hidden when not in use. "]

{"sheet":"1. Information","index":1,"n_rows":20,"n_cols":5,"rows_kept":20}
["Press UP or DOWN arrow to read through table. Use UP or DOWN arrow to read through document. Press LEFT or RIGHT arrow to input needed information. ","STATE OF CALIFORNIA",null,null,"Department of Health Care Services"]
[null,"HEALTH AND HUMAN SERVICES AGENCY"]
[]
[null,"DHCS 1822 A (02/19)"]
[null,"Annual Mental Health Services Act (MHSA) Revenue and Expenditure Report"]
[null,{"$f":"\"Fiscal Year: \"&D10","v":"Fiscal Year: 2018-19"}]
[null,"Information Worksheet"]
[]
{"$rows_left_out":13}
{"sheet":"Instructions 1. Information","index":2,"n_rows":13,"n_cols":1,"rows_kept":13}
["Press UP or DOWN arrow to read through the instructions."]
["Row 1: Enter the date when the ARER was completed."]
["Row 2: Enter the reporting fiscal year for the ARER. "]
["Row 3: Selection Only. Select the name of the County for which this ARER was prepared from the pull-down menu in the response cell."]
["Row 4: No entry. This field will auto populate. The County code is consistent with the coding system used in the Data Collection and Reporting system."]
["Row 5: Enter the administrative headquarters address for the County Mental Health or Behavioral Health Department as appropriate."]
["Row 6: Enter the administrative headquarters city for the County Mental Health or Behavioral Health Department as appropriate."]
["Row 7: Enter the administrative headquarters zip code for the County Mental Health or Behavioral Health Department as appropriate."]
{"$rows_left_out":6}
{"sheet":"2. Component Summary","index":3,"n_rows":46,"n_cols":10,"rows_kept":46}
["Press UP or DOWN arrow to navigate through section tables. Press UP and DOWN arrow to read expenditure types. Press LEFT or RIGHT arrow on each row to input funding amounts.","STATE OF CALIFORNIA",{"$nulls":6},"Department of Health Care Services"]
[null,"HEALTH AND HUMAN SERVICES AGENCY"]
[]
[null,"DHCS 1822 B (02/19)"]
[null,{"$f":"'1. Information'!B5","v":"Annual Mental Health Services Act (MHSA) Revenue and Expenditure Report"}]
[null,{"$f":"'1. Information'!B6","v":"Fiscal Year: 2018-19"}]
[null,"Component Summary Worksheet"]
[]
{"$rows_left_out":39}
{"sheet":"Instructions 2. Component Summa","index":4,"n_rows":80,"n_cols":1,"rows_kept":80}
["Use UP or DOWN arrow to navigate spreadsheet. "]
["County: No entry. This field will auto-populate from the Information worksheet."]
["Date: No entry. This field will auto-populate from the Information worksheet."]
["Row 1, Column A: Enter the amount of interest earned on MHSA funds that is attributable to the CSS Account."]
["Row 1, Column B: Enter the amount of interest earned on MHSA funds that is attributable to the PEI Account."]
["Row 1, Column C: Enter the amount of interest earned on MHSA funds that is attributable to the INN Account."]
["Row 1, Column D: Enter the amount of interest earned on MHSA funds that is attributable to the WET Account."]
["Row 1, Column E: Enter the amount of interest earned on MHSA funds that is attributable to the CFTN Account."]
{"$rows_left_out":73}
{"sheet":"3. CSS","index":5,"n_rows":133,"n_cols":12,"rows_kept":133}
["Press UP or DOWN arrow to read through C S S spreadsheet. In section 1, use UP and DOWN arrow for different C S S expenditure types. Use LEFT or RIGHT arrow on these cell rows to input amount of funding type. In section 2, use LEFT or RIGHT arrow to navigate different headers. Use UP and DOWN arrow to input dollar amount designated for each column.","STATE OF CALIFORNIA",{"$nulls":9},"Department of Health Care Services"]
[null,"HEALTH AND HUMAN SERVICES AGENCY"]
[]
[null,"DHCS 1822 C (02/19)"]
[null,{"$f":"'1. Information'!B5","v":"Annual Mental Health Services Act (MHSA) Revenue and Expenditure Report"}]
[null,{"$f":"'1. Information'!B6","v":"Fiscal Year: 2018-19"}]
[null,"Community Services and Supports (CSS) Summary  Worksheet"]
[]
{"$rows_left_out":126}
{"sheet":"Instructions 3. CSS","index":6,"n_rows":91,"n_cols":1,"rows_kept":91}
["Use UP or DOWN arrow to navigate spreadsheet. "]
["County: No entry. This field will auto-populate from the Information worksheet."]
["Date: No entry. This field will auto-populate from the Information worksheet."]
["Row 1, Column A: Enter the amount of MHSA funds, including interest, expended for CSS Annual Planning."]
["Row 1, Column B: Enter the amount of Medi-Cal FFP funds expended for CSS Annual Planning."]
["Row 1, Column C: Enter the amount of 1991 Realignment funds expended for CSS Annual Planning."]
["Row 1, Column D: Enter the amount of Behavioral Health Subaccount funds expended for CSS Annual Planning."]
["Row 1, Column E: Enter the amount of Other funds expended for CSS Annual Planning. Other funds include funding from sources not otherwise identified such as from local General Fund or other local sources, or from sources such as Federal grants or other grants."]
{"$rows_left_out":84}
{"sheet":"4. PEI","index":7,"n_rows":133,"n_cols":19,"rows_kept":133}
["Press UP or DOWN arrow to read through P E I spreadsheet. In section 1, use the UP and DOWN arrow for different P E I expenditure types. Use LEFT or RIGHT arrow on these cell rows to input amount of funding type. In section 2, use LEFT or RIGHT and UP and DOWN arrows to navigate headers. In section 3, use LEFT or RIGHT arrows to navigate headers for P E I program components on the header rows. Use UP or DOWN arrows to read each Program Name and LEFT or RIGHT arrows on the rows below the headers to input dollar amount needed. ","STATE OF CALIFORNIA",{"$nulls":14},"Department of Health Care Services"]
[null,"HEALTH AND HUMAN SERVICES AGENCY"]
[]
[null,"DHCS 1822 D (02/19)"]
[null,{"$f":"'1. Information'!B5","v":"Annual Mental Health Services Act (MHSA) Revenue and Expenditure Report"}]
[null,{"$f":"'1. Information'!B6","v":"Fiscal Year: 2018-19"}]
[null,"Prevention and Early Intervention (PEI) Summary Worksheet"]
[]
{"$rows_left_out":126}
{"sheet":"Instructions 4. PEI","index":8,"n_rows":68,"n_cols":1,"rows_kept":68}
["Use UP or DOWN arrow to navigate spreadsheet. "]
["County: No entry. This field will auto-populate from the Information worksheet."]
["Date: No entry. This field will auto-populate from the Information worksheet."]
["Row 1, Column A: Enter the amount of MHSA funds, including interest, expended for PEI Annual Planning."]
["Row 1, Column B: Enter the amount of Medi-Cal FFP funds expended for PEI Annual Planning."]
["Row 1, Column C: Enter the amount of 1991 Realignment funds expended for PEI Annual Planning."]
["Row 1, Column D: Enter the amount of Behavioral Health Subaccount funds expended for PEI Annual Planning."]
["Row 1, Column E: Enter the amount of Other funds expended for PEI Annual Planning. Other funds include funding from sources not otherwise identified such as from local General Fund or other local sources, or from sources such as Federal grants or other grants."]
{"$rows_left_out":61}
{"sheet":"5. INN","index":9,"n_rows":128,"n_cols":17,"rows_kept":128}
["Press UP or DOWN arrow to read through I N N spreadsheet. In section 1, use UP and DOWN arrow for different I N N expenditure types. Use LEFT or RIGHT arrow on these cell rows to input amount of funding type. In section 2, use LEFT or RIGHT arrow to navigate different headers. Use UP and DOWN arrow to input necessary information designated for each column. ","STATE OF CALIFORNIA",{"$nulls":13},"Department of Health Care Services"]
[null,"HEALTH AND HUMAN SERVICES AGENCY"]
[]
[null,"DHCS 1822 E (02/19)"]
[null,{"$f":"'1. Information'!B5","v":"Annual Mental Health Services Act (MHSA) Revenue and Expenditure Report"}]
[null,{"$f":"'1. Information'!B6","v":"Fiscal Year: 2018-19"}]
[null,"Innovation (INN) Summary Worksheet"]
[]
{"$rows_left_out":121}
{"sheet":"Instructions 5. INN","index":10,"n_rows":113,"n_cols":1,"rows_kept":113}
["Use UP or DOWN arrow to navigate spreadsheet. "]
["County: No entry. This field will auto-populate from the Information worksheet."]
["Date: No entry. This field will auto-populate from the Information worksheet."]
["Row 1, Column A: Enter the amount of MHSA funds, including interest, expended for INN Annual Planning."]
["Row 1, Column B: Enter the amount of Medi-Cal FFP funds expended for INN Annual Planning."]
["Row 1, Column C: Enter the amount of 1991 Realignment funds expended for INN Annual Planning."]
["Row 1, Column D: Enter the amount of Behavioral Health Subaccount funds expended for INN Annual Planning."]
["Row 1, Column E: Enter the amount of Other funds expended for INN Annual Planning. Other funds include funding from sources not otherwise identified such as from local General Fund or other local sources, or from sources such as Federal grants or other grants."]
{"$rows_left_out":106}
{"sheet":"6. WET","index":11,"n_rows":32,"n_cols":11,"rows_kept":32}
["Press UP or DOWN arrow to read through the WET spreadsheet. In section 1, use the UP and DOWN arrow for different WET expenditures. Use LEFT or RIGHT arrow on these cell rows to input amount of fund type. In section 2, use the UP and DOWN arrow to read through the different funding categories and use LEFT or RIGHT arrow to input amount of fund type. ","STATE OF CALIFORNIA",{"$nulls":8},"Department of Health Care Services"]
[null,"HEALTH AND HUMAN SERVICES AGENCY"]
[]
[null,"DHCS 1822 F (02/19)"]
[null,{"$f":"'1. Information'!B5","v":"Annual Mental Health Services Act (MHSA) Revenue and Expenditure Report"}]
[null,{"$f":"'1. Information'!B6","v":"Fiscal Year: 2018-19"}]
[null,"Workforce Education and Training (WET) Summary Worksheet"]
[]
{"$rows_left_out":25}
{"sheet":"Instructions 6. WET","index":12,"n_rows":85,"n_cols":1,"rows_kept":85}
["Use UP or DOWN arrow to navigate through spreadsheet. "]
["County: No entry. This field will auto-populate from the Information worksheet."]
["Date: No entry. This field will auto-populate from the Information worksheet."]
["Row 1, Column A: Enter the amount of MHSA funds, including interest, expended for WET Annual Planning."]
["Row 1, Column B: Enter the amount of Medi-Cal FFP funds expended for WET Annual Planning."]
["Row 1, Column C: Enter the amount of 1991 Realignment funds expended for WET Annual Planning."]
["Row 1, Column D: Enter the amount of Behavioral Health Subaccount funds expended for WET Annual Planning."]
["Row 1, Column E: Enter the amount of Other funds expended for WET Annual Planning. Other funds include funding from sources not otherwise identified such as from local General Fund or other local sources, or from sources such as Federal grants or other grants."]
{"$rows_left_out":78}
{"sheet":"7. CFTN","index":13,"n_rows":46,"n_cols":12,"rows_kept":46}
["Press UP or DOWN arrow to navigate through CFTN spreadsheet. In section 1, use UP and DOWN arrow to read the CFTN expenditures and use the LEFT or RIGHT arrows to input amount of funding type. In section 2, use LEFT or RIGHT arrow on the header column to read about project components and use the UP or DOWN arrow on these cells to input needed information. ","STATE OF CALIFORNIA",{"$nulls":9},"Department of Health Care Services"]
[null,"HEALTH AND HUMAN SERVICES AGENCY"]
[]
[null,"DHCS 1822 G (02/19)"]
[null,{"$f":"'1. Information'!B5","v":"Annual Mental Health Services Act (MHSA) Revenue and Expenditure Report"}]
[null,{"$f":"'1. Information'!B6","v":"Fiscal Year: 2018-19"}]
[null,"Capital Facility Technological Needs (CFTN) Summary Worksheet"]
[]
{"$rows_left_out":39}
{"sheet":"Instructions 7. CFTN","index":14,"n_rows":55,"n_cols":1,"rows_kept":55}
["Use UP or DOWN arrow to navigate spreadsheet. "]
["County: No entry. This field will auto-populate from the Information worksheet."]
["Date: No entry. This field will auto-populate from the Information worksheet."]
["Row 1, Column A: Enter the amount of MHSA funds, including interest, expended for CFTN Annual Planning."]
["Row 1, Column B: Enter the amount of Medi-Cal FFP funds expended for CFTN Annual Planning."]
["Row 1, Column C: Enter the amount of 1991 Realignment funds expended for CFTN Annual Planning."]
["Row 1, Column D: Enter the amount of Behavioral Health Subaccount funds expended for CFTN Annual Planning."]
["Row 1, Column E: Enter the amount of Other funds expended for CFTN Annual Planning. Other funds include funding from sources not otherwise identified such as from local General Fund or other local sources, or from sources such as Federal grants or other grants."]
{"$rows_left_out":48}
{"sheet":"8. Adjustment (MHSA)","index":15,"n_rows":80,"n_cols":8,"rows_kept":80}
["Press UP or DOWN arrow to input items into each row. Use LEFT or RIGHT arrow on Row 12 to read the headers for information needed. ","STATE OF CALIFORNIA",{"$nulls":5},"Department of Health Care Services"]
[null,"HEALTH AND HUMAN SERVICES AGENCY"]
[]
[null,"DHCS 1822 H (02/19)"]
[null,{"$f":"'1. Information'!B5","v":"Annual Mental Health Services Act (MHSA) Revenue and Expenditure Report"}]
[null,{"$f":"'1. Information'!B6","v":"Fiscal Year: 2018-19"}]
[null,"MHSA Adjustments Worksheet "]
[]
{"$rows_left_out":73}
{"sheet":"Instructions 8. Adjust (MHSA)","index":16,"n_rows":13,"n_cols":1,"rows_kept":13}
["Use UP or DOWN arrow to navigate spreadsheet. "]
["County: No entry. This field will auto-populate from the Information worksheet."]
["Date: No entry. This field will auto-populate from the Information worksheet."]
["Rows 1-60, Column A: No entry. This field auto-populates as the County enters expenditure data and is determined according to the County Name entered on  Worksheet 1. Information, Row 3. The County Code corresponds to the numeric ID code used to identify the County in the Data Collection and Reporting system."]
["Rows 1-30, Column B: Selection only. Enter the Account  for which the MHSA adjustment is being reported. Options include CSS, PEI, INN, WET, or CFTN."]
["Rows 1-30, Column C: Selection only. Enter the adjustment type. Options include expenditure or interest revenue. "]
["Rows 1-30, Column D: Enter the Fiscal Year for which the adjustment is being reported."]
["Rows 1-30, Column E: Enter the amount of the adjustment. Enter a positive number to reflect an increase in MHSA expenditures or interest revenue and a negative number to reflect a decrease in MHSA expenditures or interest revenue."]
{"$rows_left_out":6}
{"sheet":"9. Adjustment (FFP)","index":17,"n_rows":54,"n_cols":9,"rows_kept":54}
["Press UP or DOWN arrow to input items into each row. Use LEFT or RIGHT arrow on Row 12 to read the headers for information needed. ","STATE OF CALIFORNIA",{"$nulls":6},"Department of Health Care Services"]
[null,"HEALTH AND HUMAN SERVICES AGENCY"]
[]
[null,"DHCS 1822 I (02/19)"]
[null,{"$f":"'1. Information'!B5","v":"Annual Mental Health Services Act (MHSA) Revenue and Expenditure Report"}]
[null,{"$f":"'1. Information'!B6","v":"Fiscal Year: 2018-19"}]
[null,"FFP Revenue Adjustment Worksheet"]
[]
{"$rows_left_out":47}
{"sheet":"Instructions 9. Adjust (FFP)","index":18,"n_rows":10,"n_cols":1,"rows_kept":10}
["Use UP or DOWN arrow to navigate spreadsheet. "]
["County: No entry. This field will auto-populate from the Information worksheet."]
["Date: No entry. This field will auto-populate from the Information worksheet."]
["Rows 1-40, Column A: No entry. This field auto-populates as the County enters expenditure data and is determined according to the County Name entered on  Worksheet 1. Information, Row 3. The County Code corresponds to the numeric ID code used to identify the County in the Data Collection and Reporting system."]
["Rows 1-40, Column B: Enter the fiscal year for which the County is entering an adjustment to the amount of MHSA funds expended due to a change in FFP revenue."]
["Rows 1-40, Column C: Selection only. Enter cost report stage.  Options include Initial, Settled, Audited. Select Initial if the adjustment is due to a change to the amount of FFP revenue after the County filed its initial cost report for the Fiscal Year identified in Column B.  Select Settled, if the adjustment is due to a change to the amount of FFP revenue after the Department completed its interim cost report settlement for the Fiscal Year identified in Column B.  Select Audit, if the adjustment is due to a change to the amount of FFP revenue received after DHCS completed its audit of the cost report for the Fiscal Year identified in Column B."]
["Rows 1-40, Column D: Selection only. Enter the Account  for which the MHSA adjustment is being reported. Options include CSS, PEI, INN, WET, or CFTN."]
["Rows 1-40, Column E: Enter the amount of MHSA funds expended for the component identified in Column D as reported in the ARER filed for the fiscal year identified in Column B."]
{"$rows_left_out":3}
{"sheet":"10. Comments","index":19,"n_rows":52,"n_cols":7,"rows_kept":52}
["Press UP or DOWN arrow to leave comments on the cell rows. ","STATE OF CALIFORNIA",{"$nulls":3},"Department of Health Care Services"]
[null,"HEALTH AND HUMAN SERVICES AGENCY"]
[]
[null,"DHCS 1822 J (02/19)"]
[null,{"$f":"'1. Information'!B5","v":"Annual Mental Health Services Act (MHSA) Revenue and Expenditure Report"}]
[null,{"$f":"'1. Information'!B6","v":"Fiscal Year: 2018-19"}]
[null,"Comments Worksheet"]
[]
{"$rows_left_out":45}
{"sheet":"Instructions 10. Comments","index":20,"n_rows":6,"n_cols":1,"rows_kept":6}
["Use UP or DOWN arrow to navigate spreadsheet. "]
["County: No entry. This field will auto-populate from the Information worksheet."]
["Date: No entry. This field will auto-populate from the Information worksheet."]
["Rows 1-40, Column A: Selection only. Select the account for which the Comment is necessary."]
["Rows 1-40. Column B: Enter the Fiscal Year for which the Comment is necessary."]
["Rows 1-40, Column C: Enter the Comment."]

{"sheet":"Checks","index":21,"n_rows":64,"n_cols":9,"rows_kept":64,"hidden":true}
["SCO Distribution"]
["FY 2017-18"]
[null,null,"Total x 76%","Total x 19%","Total x 5%",null,"County Check:",{"$f":"'1. Information'!D11","v":"Kings"}]
["County","TOTAL","CSS","PEI","INN"]
["Alameda",{"v":70551654.33,"d":"$70,551,654.33"},{"$f":"B5*0.76","v":{"v":53619257.2908,"d":"$53,619,257.29"}},{"$f":"B5*0.19","v":{"v":13404814.3227,"d":"$13,404,814.32"}},{"$f":"B5*0.05","v":{"v":3527582.7165,"d":"$3,527,582.72"}},null,"Cell","Status","Notes"]
["Alpine",{"v":1499512.8499999999,"d":"$1,499,512.85"},{"$f":"B6*0.76","v":{"v":1139629.7659999998,"d":"$1,139,629.77"}},{"$f":"B6*0.19","v":{"v":284907.44149999996,"d":"$284,907.44"}},{"$f":"B6*0.05","v":{"v":74975.6425,"d":"$74,975.64"}},null,"='2. Component Summary'!I24",{"$f":"IF(SUM('2. Component Summary'!D27:H27)='2. Component Summary'!I27,\"OK\",\"ERROR\")","v":"OK"},"CSS Transfers to PEI, WET, CFTN, or Prudent Reserve must net to total 0"]
["Amador",{"v":2931915.6899999995,"d":"$2,931,915.69"},{"v":2228255.9243999994,"d":"$2,228,255.92"},{"v":557063.9810999999,"d":"$557,063.98"},{"v":146595.78449999998,"d":"$146,595.78"},null,"='2. Component Summary'!D37",{"$f":"IF('2. Component Summary'!D40*0.05>VLOOKUP(H3,SCO_Distribution,2,FALSE),\"ERROR\",\"OK\")","v":"OK"},"Total MHSA costs for planning for all components may not exceed 5 percent of the total annual MHSA revenues received by the County."]
["Berkeley",{"v":5994545.009999999,"d":"$5,994,545.01"},{"v":4555854.207599999,"d":"$4,555,854.21"},{"v":1138963.5518999998,"d":"$1,138,963.55"},{"v":299727.25049999997,"d":"$299,727.25"},null,"='2. Component Summary'!D43",{"$f":"IF(ISBLANK('2. Component Summary'!D46),\"ERROR\",\"OK\")","v":"OK"},"Counties must report total MHSA funds spent on mental health services provided to veterans for all programs and projects funded through the Community Services and Supports, Prevention and Early Intervention, and Innovation components, combined. ENTER $0 IF NO SPENDING."]
{"$rows_left_out":57}
{"sheet":"drop down fields","index":22,"n_rows":60,"n_cols":14,"rows_kept":60,"hidden":true,"merged":[[0,0,0,1]]}
["Info_County_Code",null,"Info_Population","CSS_Service_Category","PEI_Combined_Standalone","PEI_Program_Type","INN_Expenditure_Type","WET_Funding_Category","CFTN_Project_Type","Adjustment_MHSA_Component","MHSA_Adjustment_FY","FFP_Adjustment_FY","Adjustment_Reason","Cost_Report_Stage"]
["Alameda",{"v":1,"d":"01"},"Yes","FSP","Combined","Prevention","Project","Workforce Staffing","Capital Facility","CSS","FY 2015-16","FY 2009-10","Cost Report Reconciliation","Audited"]
["Alpine",{"v":2,"d":"02"},"No","Non-FSP","Standalone","Early Intervention","Project Administration","Training/Technical Assistance","Technological Need","PEI","FY 2016-17","FY 2010-11","Cost Report Audit","Settled"]
["Amador",{"v":3,"d":"03"},{"$nulls":3},"Outreach","Project Evaluation","MH Career Pathways",null,"INN",null,"FY 2011-12","SDMC Chart Audit","Initial"]
["Berkeley City",65,{"$nulls":3},"Stigma & Discrimination Reduction",null,"Residency/Internship",null,"WET",null,"FY 2012-13","Local Quality Assurance Audit"]
["Butte",{"v":4,"d":"04"},{"$nulls":3},"Suicide Prevention",null,"Financial Incentive",null,"CFTN",null,"FY 2013-14","Error"]
["Calaveras",{"v":5,"d":"05"},{"$nulls":3},"Access and Linkage",{"$nulls":3},"WET RP",null,"FY 2014-15","Other"]
["Colusa",{"v":6,"d":"06"},{"$nulls":3},"Improving Timely Access",{"$nulls":3},"PEI SW",null,"FY 2015-16"]
{"$rows_left_out":53}
{"sheet":"E-1 CountyState2017","index":23,"n_rows":83,"n_cols":5,"rows_kept":83,"hidden":true,"merged":[[1,0,1,4],[2,0,2,4],[4,1,4,2]]}
[{"$nulls":3},"About the Data"]
["E-1: State/County Population Estimates with Annual Percent Change"]
["January 1, 2017 and 2018"]
[]
["State/County","           Total Population",null,"Percent"]
[null,"2017-01-01","2018-01-01","Change","County Population:  Over 200,000? (Yes or No)"]
[]
["California",{"v":39500973,"d":"39,500,973"},{"v":39809693,"d":"39,809,693"},0.8]
{"$rows_left_out":75}